FEL skrev:Ett alternativ till att dumpa WMV-filer är att dumpa VF6F (FLV)-filer med
rtmpdump. Jag lyckades med detta på ett liknande sätt:
Intressant.

(och texten där rtmpdumpen låg är även den underhållande....)
Edit: Hittar dock inte det i Ubuntus repo...
OT: Edit II: Bygga det verkar kräva lite magi hos mig.... inte orkat få rätt på det än och får följande felmess
Kod: Markera allt
make[1]: Går till katalogen "/downloads/rtmpdump-1.9"
g++ -Wall -O2 -c -o rtmp.o rtmp.cpp
In file included from rtmp.h:44,
from rtmp.cpp:42:
dh.h:22:24: error: openssl/bn.h: Filen eller katalogen finns inte
dh.h:23:24: error: openssl/dh.h: Filen eller katalogen finns inte
dh.h:25:25: error: openssl/sha.h: Filen eller katalogen finns inte
dh.h:26:26: error: openssl/hmac.h: Filen eller katalogen finns inte
dh.h:27:25: error: openssl/rc4.h: Filen eller katalogen finns inte
In file included from rtmp.h:44,
from rtmp.cpp:42:
dh.h:34: error: ‘BIGNUM’ was not declared in this scope
dh.h:34: error: ‘y’ was not declared in this scope
dh.h:34: error: ‘BIGNUM’ was not declared in this scope
dh.h:34: error: ‘p’ was not declared in this scope
dh.h:34: error: ‘BIGNUM’ was not declared in this scope
dh.h:34: error: ‘q’ was not declared in this scope
dh.h:34: error: initializer expression list treated as compound expression
dh.h:35: error: expected constructor, destructor, or type conversion before ‘*’ token
dh.h:36: error: ‘DH’ was not declared in this scope
dh.h:36: error: ‘dh’ was not declared in this scope
dh.h:37: error: ‘DH’ was not declared in this scope
dh.h:37: error: ‘dh’ was not declared in this scope
dh.h:37: error: expected primary-expression before ‘*’ token
dh.h:37: error: ‘pubkey’ was not declared in this scope
dh.h:37: error: expected primary-expression before ‘nPubkeyLen’
dh.h:37: error: initializer expression list treated as compound expression
dh.h:38: error: ‘DH’ was not declared in this scope
dh.h:38: error: ‘dh’ was not declared in this scope
dh.h:38: error: expected primary-expression before ‘*’ token
dh.h:38: error: ‘privkey’ was not declared in this scope
dh.h:38: error: expected primary-expression before ‘nPrivkeyLen’
dh.h:38: error: initializer expression list treated as compound expression
dh.h:39: error: ‘DH’ was not declared in this scope
dh.h:39: error: ‘dh’ was not declared in this scope
dh.h:39: error: expected primary-expression before ‘*’ token
dh.h:39: error: ‘pubkey’ was not declared in this scope
dh.h:39: error: expected primary-expression before ‘nPubkeyLen’
dh.h:39: error: expected primary-expression before ‘*’ token
dh.h:39: error: ‘secret’ was not declared in this scope
dh.h:39: error: initializer expression list treated as compound expression
dh.h:40: error: variable or field ‘DHFree’ declared void
dh.h:40: error: ‘DH’ was not declared in this scope
dh.h:40: error: ‘dh’ was not declared in this scope
In file included from rtmp.cpp:42:
rtmp.h:97: error: ISO C++ forbids declaration of ‘DH’ with no type
rtmp.h:97: error: expected ‘;’ before ‘*’ token
rtmp.h:98: error: ISO C++ forbids declaration of ‘RC4_KEY’ with no type
rtmp.h:98: error: expected ‘;’ before ‘*’ token
rtmp.h:99: error: ISO C++ forbids declaration of ‘RC4_KEY’ with no type
rtmp.h:99: error: expected ‘;’ before ‘*’ token
rtmp.cpp: In member function ‘int RTMP_LIB::CRTMP::ReadN(char*, int)’:
rtmp.cpp:653: error: ‘struct RTMP_LIB::LNK’ has no member named ‘rc4keyIn’
rtmp.cpp:654: error: ‘struct RTMP_LIB::LNK’ has no member named ‘rc4keyIn’
rtmp.cpp:654: error: ‘RC4’ was not declared in this scope
rtmp.cpp: In member function ‘bool RTMP_LIB::CRTMP::WriteN(const char*, int)’:
rtmp.cpp:672: error: ‘struct RTMP_LIB::LNK’ has no member named ‘rc4keyOut’
rtmp.cpp:674: error: ‘struct RTMP_LIB::LNK’ has no member named ‘rc4keyOut’
rtmp.cpp:674: error: ‘RC4’ was not declared in this scope
make[1]: *** [rtmp.o] Fel 1
make[1]: Lämnar katalogen "/downloads/rtmpdump-1.9"
make: *** [linux] Fel 2